{"text_format":"1","workbook":"xlsx","n_sheets":9,"sheets":["①漢字入力","合体クイズ","迷路１","迷路２","迷路3","編集","②漢字データ","Sheet1","データ"],"not_rendered":{"charts":0,"images":0,"macros":1,"external_links":3,"defined_names":15,"comments":0,"pivot_tables":0},"unopened":[],"bounds":{"document_bytes":16777216,"sheet_cells":100000,"rows_first":2000,"rows_last":500,"rows_between":2000,"halvings":0,"cell_chars":16384,"cell_head_chars":4096},"cells_cut":0,"cells_raw":0,"read":"whole","date_system":"1900"}

{"sheet":"①漢字入力","index":0,"n_rows":1034,"n_cols":35,"rows_kept":1034,"cut":false,"hidden":false,"merged":[[12,9,12,11],[1,0,1,1]]}
[]
["④修正",null,{"$f":"R2&S2","v":"2年"},"年",null,null,"最後に習った漢字",null,null,null,null,"①",null,"歩",null,null,{"$f":"VLOOKUP(N2,$O$5:$P$1033,2,FALSE)","v":2.0459999999999998},{"$f":"INT(Q2)","v":2},"年",{"$f":"(Q2-R2)*1000","v":45.999999999999815},"番目に習う漢字"]
[]
[]
[null,"古",{"$f":"VLOOKUP(B5,$O$5:$P$1033,2,FALSE)","v":2.1070000000000002},{"$f":"1000*C5","v":2107},{"$f":"IF(D5=\"\",\"\",VLOOKUP(D5,②漢字データ!$A$2:$H$1496,6,0))","v":"十"},{"$f":"VLOOKUP(E5,$O$5:$P$1060,2,FALSE)","v":1.0129999999999999},{"$f":"IF(F5>$Q$2,\"×\",\"〇\")","v":"〇"},{"$f":"IF(D5=\"\",\"\",VLOOKUP(D5,②漢字データ!$A$2:$H$1496,8,0))","v":"口"},{"$f":"VLOOKUP(H5,$O$5:$P$1060,2,FALSE)","v":1.0669999999999999},{"$f":"IF(I5>$Q$2,\"×\",\"〇\")","v":"〇"},null,null,null,null,"木",1.0009999999999999,{"$f":"IF(P5>$Q$2,\"0\",\"1\")","v":"1"}]
[1,"歩",2.0459999999999998,2045.9999999999998,{"$f":"IF(D6=\"\",\"\",VLOOKUP(D6,②漢字データ!$A$2:$H$1496,6,0))","v":"止"},2.11,"×",{"$f":"IF(D6=\"\",\"\",VLOOKUP(D6,②漢字データ!$A$2:$H$1496,8,0))","v":"少"},2.1440000000000001,"×",null,null,null,null,"大",1.002,{"$f":"IF(P6>$Q$2,\"0\",\"1\")","v":"1"}]
[2,"姉",2.04,2040,{"$f":"IF(D7=\"\",\"\",VLOOKUP(D7,②漢字データ!$A$2:$H$1496,6,0))","v":"女"},1.0169999999999999,"〇",{"$f":"IF(D7=\"\",\"\",VLOOKUP(D7,②漢字データ!$A$2:$H$1496,8,0))","v":"市"},2.1349999999999998,"×",null,null,null,null,"小",1.0029999999999999,"1"]
[3,"切",2.0369999999999999,2037,{"$f":"IF(D8=\"\",\"\",VLOOKUP(D8,②漢字データ!$A$2:$H$1496,6,0))","v":"七"},1.01,"〇",{"$f":"IF(D8=\"\",\"\",VLOOKUP(D8,②漢字データ!$A$2:$H$1496,8,0))","v":"刀"},2.036,"〇",null,null,null,null,"一",1.004,"1"]
[4,"社",2.0350000000000001,2035.0000000000002,{"$f":"IF(D9=\"\",\"\",VLOOKUP(D9,②漢字データ!$A$2:$H$1496,6,0))","v":"ネ"},{"$error":"#N/A"},{"$error":"#N/A"},{"$f":"IF(D9=\"\",\"\",VLOOKUP(D9,②漢字データ!$A$2:$H$1496,8,0))","v":"土"},1.0549999999999999,"〇",null,null,null,null,"二",1.0049999999999999,"1"]
[5,"体",2.0299999999999998,2029.9999999999998,{"$f":"IF(D10=\"\",\"\",VLOOKUP(D10,②漢字データ!$A$2:$H$1496,6,0))","v":"イ"},{"$error":"#N/A"},{"$error":"#N/A"},{"$f":"IF(D10=\"\",\"\",VLOOKUP(D10,②漢字データ!$A$2:$H$1496,8,0))","v":"本"},1.042,"〇",null,null,null,null,"三",1.006,"1"]
[6,"多",2.0259999999999998,2025.9999999999998,{"$f":"IF(D11=\"\",\"\",VLOOKUP(D11,②漢字データ!$A$2:$H$1496,6,0))","v":"タ"},{"$error":"#N/A"},{"$error":"#N/A"},{"$f":"IF(D11=\"\",\"\",VLOOKUP(D11,②漢字データ!$A$2:$H$1496,8,0))","v":"タ"},{"$error":"#N/A"},{"$error":"#N/A"},null,null,"②",null,"四",1.0069999999999999,"1",null,null,null,"止","+","少",null,null,null,"＝","歩"]
[null,null,null,null,null,null,null,null,null,null,{"$f":"IF(K16=12,\"○\",\"×\")","v":"×"},null,null,null,"五",1.008,"1",null,null,null,"女","+","市",null,null,null,"＝","姉"]
[null,{"$f":"E6","v":"止"},{"$f":"COUNTIF($E$6:$H$11,B13)","v":1},{"$f":"E9","v":"ネ"},{"$f":"COUNTIF($E$6:$H$11,D13)","v":1},{"$f":"H6","v":"少"},{"$f":"COUNTIF($E$6:$H$11,F13)","v":1},{"$f":"H9","v":"土"},{"$f":"COUNTIF($E$6:$H$11,H13)","v":1},"③チェック",null,null,null,null,"六",1.0089999999999999,"1",null,null,null,"七","+","刀",null,null,null,"＝","切"]
[null,{"$f":"E7","v":"女"},{"$f":"COUNTIF($E$6:$H$11,B14)","v":1},{"$f":"E10","v":"イ"},{"$f":"COUNTIF($E$6:$H$11,D14)","v":1},{"$f":"H7","v":"市"},{"$f":"COUNTIF($E$6:$H$11,F14)","v":1},{"$f":"H10","v":"本"},{"$f":"COUNTIF($E$6:$H$11,H14)","v":1},null,null,null,null,null,"七",1.01,"1",null,null,null,"ネ","+","土",null,null,null,"＝","社"]
[null,{"$f":"E8","v":"七"},{"$f":"COUNTIF($E$6:$H$11,B15)","v":1},{"$f":"E11","v":"タ"},{"$f":"COUNTIF($E$6:$H$11,D15)","v":2},{"$f":"H8","v":"刀"},{"$f":"COUNTIF($E$6:$H$11,F15)","v":1},{"$f":"H11","v":"タ"},{"$f":"COUNTIF($E$6:$H$11,H15)","v":2},null,null,null,null,null,"八",1.0109999999999999,"1",null,"・・",null,"イ","+","本",null,null,null,"＝","体"]
[null,null,{"$f":"SUM(C13:C15)","v":3},null,{"$f":"SUM(E13:E15)","v":4},null,{"$f":"SUM(G13:G15)","v":3},null,{"$f":"SUM(I13:I15)","v":4},null,{"$f":"C16+E16+G16+I16","v":14},null,null,null,"九",1.012,"1",null,null,null,"タ","+","タ",null,null,null,"＝","多"]
[null,null,null,null,null,null,null,null,null,null,null,null,null,null,"十",1.0129999999999999,"1",null,null,null,"日","+","青",null,null,null,"＝","晴"]
[null,null,null,null,null,null,null,null,null,null,null,null,null,null,"子",1.014,"1",null,null,null,"田","+","心",null,null,null,"＝","思"]
[null,null,null,null,null,null,null,null,null,null,null,null,null,null,"空",1.0149999999999999,"1",null,null,null,"八","+","刀",null,null,null,"＝","分"]
[null,null,null,null,null,null,null,null,null,null,null,null,null,null,"男",1.016,"1",null,null,null,"糸","+","会",null,null,null,"＝","絵"]
[null,null,null,null,null,null,null,null,null,null,null,null,null,null,"女",1.0169999999999999,"1",null,null,null,"言","+","売",null,null,null,"＝","読"]
[null,null,null,null,null,null,null,null,null,null,null,null,null,null,"手",1.018,"1",null,null,null,"木","+","木",null,null,null,"＝","林"]
[null,null,null,null,null,null,null,null,null,null,null,null,null,null,"天",1.0189999999999999,"1",null,null,null,"日","+","生",null,null,null,"＝","計"]
[null,null,null,null,null,null,null,null,null,null,null,null,null,null,"青",1.02,"1",null,null,null,"小","+","ノ",null,null,null,"＝","少"]
[null,null,null,null,null,null,null,null,null,null,null,null,null,null,"見",1.0209999999999999,"1"]
[null,null,null,null,null,null,null,null,null,null,null,null,null,null,"学",1.022,"1"]
[null,null,null,null,null,null,null,null,null,null,null,null,null,null,"校",1.0229999999999999,"1","木","交"]
[null,null,null,null,null,null,null,null,null,null,null,null,null,null,"虫",1.024,"1"]
[null,null,null,null,null,null,null,null,null,null,null,null,null,null,"文",1.0249999999999999,"1"]
[null,null,null,null,null,null,null,null,null,null,null,null,null,null,"正",1.026,"1"]
{"$rows_left_out":1005}
{"sheet":"合体クイズ","index":1,"n_rows":55,"n_cols":69,"rows_kept":55,"cut":false,"hidden":false,"merged":[[54,3,54,34],[56,1,61,6],[56,7,61,12],[56,13,61,18],[56,19,61,24],[56,25,61,30],[56,31,61,36],[33,44,38,49],[33,50,38,55],[33,56,38,61],[33,68,38,72],[39,44,44,49],[39,50,44,55],[39,56,44,61],[39,62,44,67],[39,68,44,72],[33,62,38,67],[40,1,45,6],[40,29,45,34],[47,10,52,15],[47,18,52,23],[26,29,31,34],[33,1,38,6],[33,29,38,34],[21,56,26,61],[21,62,26,67],[21,68,26,72],[26,1,31,6],[27,44,32,49],[27,50,32,55],[27,56,32,61],[27,62,32,67],[27,68,32,72],[19,1,24,6],[19,29,24,34],[21,44,26,49],[21,50,26,55],[7,50,12,55],[7,56,12,61],[7,62,12,67],[7,68,12,72],[11,11,17,16],[11,19,17,24],[13,44,20,49],[13,50,20,55],[13,56,20,61],[13,62,20,67],[7,44,12,49],[13,68,20,72],[0,2,3,28],[0,29,3,34],[0,35,3,37],[5,6,8,11],[5,12,8,38]]}
[null,null,"漢字合体クイズ　"]
[]
[]
[]
[]
[null,null,null,null,null,null,{"$f":"①漢字入力!C2","v":"2年"},null,null,null,null,null,"名前　（　　　　　　　　　　　　　　）"]
[]
[null,null,null,null,null,null,null,null,null,null,null,null,null,null,null,null,null,null,null,null,null,null,null,null,null,null,null,null,null,null,null,null,null,null,null,null,null,null,null,null,null,null,null,null,{"$f":"①漢字入力!$E$6","v":"止"},null,null,null,null,null,"＋",null,null,null,null,null,{"$f":"①漢字入力!$H$6","v":"少"},null,null,null,null,null,"＝",null,null,null,null,null,{"$f":"①漢字入力!B6","v":"歩"}]
[]
[]
[]
[null,null,null,null,null,null,null,null,null,null,null,{"$f":"編集!$I$5","v":"タ"},null,null,null,null,null,null,null,{"$f":"編集!$I$4","v":"刀"}]
[]
[null,null,null,null,null,null,null,null,null,null,null,null,null,null,null,null,null,null,null,null,null,null,null,null,null,null,null,null,null,null,null,null,null,null,null,null,null,null,null,null,null,null,null,null,{"$f":"①漢字入力!$E$7","v":"女"},null,null,null,null,null,"＋",null,null,null,null,null,{"$f":"①漢字入力!$H$7","v":"市"},null,null,null,null,null,"＝",null,null,null,null,null,{"$f":"①漢字入力!B7","v":"姉"}]
[]
[]
[]
[]
[]
[null,{"$f":"編集!H6","v":"イ"},null,null,null,null,null,null,null,null,null,null,null,null,null,null,null,null,null,null,null,null,null,null,null,null,null,null,null,{"$f":"編集!$H$4","v":"七"}]
[]
[null,null,null,null,null,null,null,null,null,null,null,null,null,null,null,null,null,null,null,null,null,null,null,null,null,null,null,null,null,null,null,null,null,null,null,null,null,null,null,null,null,null,null,null,{"$f":"①漢字入力!$E$8","v":"七"},null,null,null,null,null,"＋",null,null,null,null,null,{"$f":"①漢字入力!$H$8","v":"刀"},null,null,null,null,null,"＝",null,null,null,null,null,{"$f":"①漢字入力!B8","v":"切"}]
[]
[]
[]
[]
[null,{"$f":"編集!$I$2","v":"市"},null,null,null,null,null,null,null,null,null,null,null,null,null,null,null,null,null,null,null,null,null,null,null,null,null,null,null,{"$f":"編集!$I$6","v":"本"}]
[null,null,null,null,null,null,null,null,null,null,null,null,null,null,null,null,null,null,null,null,null,null,null,null,null,null,null,null,null,null,null,null,null,null,null,null,null,null,null,null,null,null,null,null,{"$f":"①漢字入力!$E$9","v":"ネ"},null,null,null,null,null,"＋",null,null,null,null,null,{"$f":"①漢字入力!$H$9","v":"土"},null,null,null,null,null,"＝",null,null,null,null,null,{"$f":"①漢字入力!B9","v":"社"}]
[]
[]
{"$rows_left_out":26}
{"sheet":"迷路１","index":2,"n_rows":34,"n_cols":26,"rows_kept":34,"cut":false,"hidden":false,"merged":[[40,2,46,7],[40,8,46,13],[40,14,46,19],[40,20,46,25],[40,26,46,31],[17,37,20,37],[33,1,37,5],[33,7,37,11],[33,13,37,17],[33,19,37,23],[33,25,37,29],[1,1,1,34],[8,1,12,5],[8,7,12,11],[8,13,12,17],[8,19,12,23],[8,25,12,29]]}
[]
[null,"漢字おもしろクイズ　名前（　　　　　　　　　）　"]
[]
[]
[null,null,"２つの漢字を合わせると、どんな漢字になるかな？"]
[]
[]
[]
[null,{"$f":"編集!$H$1","v":"ネ"},null,null,null,null,null,{"$f":"編集!$H$2","v":"女"},null,null,null,null,null,{"$f":"編集!$H$3","v":"止"},null,null,null,null,null,{"$f":"編集!$H$4","v":"七"},null,null,null,null,null,{"$f":"編集!$H$5","v":"タ"}]
[]
[]
[]
[]
[]
[]
[]
[]
[]
[]
[]
[]
[]
[]
[]
[]
[]
[]
[]
[]
[]
{"$rows_left_out":5}
{"sheet":"迷路２","index":3,"n_rows":14,"n_cols":22,"rows_kept":14,"cut":false,"hidden":false,"merged":[[0,11,0,15],[13,6,13,7],[13,8,13,9],[13,10,13,11],[13,12,13,13],[13,14,13,15],[14,6,14,7],[14,8,14,9],[14,10,14,11],[14,12,14,13],[14,14,14,15]]}
[null,null,null,null,null,"漢字合体迷路",null,null,null,{"$f":"①漢字入力!C2","v":"2年"},{"$f":"U2","v":"A①"},{"$f":"V2","v":"名前（　　　　　）"}]
[null,null,null,null,null,null,null,null,null,null,null,null,null,null,null,null,null,"漢字合わせ　",null,"３年","A①","名前（　　　　　）"]
[null,{"$f":"#REF!","v":{"$error":"#REF!"}},{"$f":"#REF!","v":{"$error":"#REF!"}},"①",null,null,null,null,null,null,null,{"$f":"編集!$H$1","v":"ネ"},null,null,null,null,null,"⑤"]
[null,{"$f":"#REF!","v":{"$error":"#REF!"}},{"$f":"#REF!","v":{"$error":"#REF!"}},null,null,null,null,null,null,null,null,null,{"$f":"編集!$H$5","v":"タ"},{"$f":"編集!$I$2","v":"市"}]
[null,{"$f":"#REF!","v":{"$error":"#REF!"}},{"$f":"#REF!","v":{"$error":"#REF!"}}]
[null,{"$f":"#REF!","v":{"$error":"#REF!"}},{"$f":"#REF!","v":{"$error":"#REF!"}},"②"]
[null,{"$f":"#REF!","v":{"$error":"#REF!"}},{"$f":"#REF!","v":{"$error":"#REF!"}},null,null,null,{"$f":"編集!$H$2","v":"女"}]
[null,null,null,null,null,null,{"$f":"編集!$I$1","v":"土"}]
[]
[null,null,null,null,null,null,null,null,null,null,{"$f":"編集!$I$3","v":"少"},{"$f":"編集!$I$4","v":"刀"},null,null,{"$f":"編集!$I$5","v":"タ"}]
[null,null,null,null,null,null,null,null,{"$f":"編集!$H$3","v":"止"},{"$f":"編集!H$4","v":"七"}]
[null,null,null,"③",null,null,null,null,null,null,null,null,null,null,null,null,null,"④"]
[]
[null,null,null,null,null,null,"⑤",null,"④",null,"③",null,"②",null,"①"]

{"sheet":"迷路3","index":4,"n_rows":36,"n_cols":32,"rows_kept":36,"cut":false,"hidden":false,"merged":[[5,4,7,6],[5,10,7,12],[5,16,7,18],[5,23,7,25],[5,31,7,33],[35,6,37,8],[35,13,37,15],[35,17,37,19],[35,23,37,25],[35,31,37,33],[41,4,46,8],[41,10,46,14],[41,16,46,20],[41,22,46,26],[41,28,46,32]]}
[]
[null,null,null,"漢字おもしろクイズ　　　　　（　　　　　　　　）",null,null,null,null,null,null,null,null,null,null,null,null,{"$f":"①漢字入力!C2","v":"2年"},null,null,null,"名前（　　　　　　　）"]
[]
[]
[]
[null,null,null,null,{"$f":"編集!$H$1","v":"ネ"},null,null,null,null,null,{"$f":"編集!$H$2","v":"女"},null,null,null,null,null,{"$f":"編集!$H$3","v":"止"},null,null,null,null,null,null,{"$f":"編集!$H$4","v":"七"},null,null,null,null,null,null,null,{"$f":"編集!$H$5","v":"タ"}]
[]
[]
[]
[]
[]
[]
[]
[]
[]
[]
[]
[]
[]
[]
[]
[]
[]
[]
[]
[]
[]
[]
[]
[]
{"$rows_left_out":7}
{"sheet":"編集","index":5,"n_rows":13,"n_cols":15,"rows_kept":13,"cut":false,"hidden":false,"merged":[]}
[null,null,null,null,null,null,1,{"$f":"IF($G1=\"\",\"\",VLOOKUP($G1,$D$2:$F$7,2,0))","v":"ネ"},{"$f":"IF($G1=\"\",\"\",VLOOKUP($G1,$D$2:$F$7,3,0))","v":"土"},null,null,null,"３年"]
[null,{"$f":"M2","v":"止"},{"$f":"RAND()","v":0.83813943114129386},{"$f":"RANK(C2,C$2:C$7)","v":3},{"$f":"B2","v":"止"},{"$f":"B8","v":"少"},2,"女","市",null,null,null,{"$f":"①漢字入力!E6","v":"止"},"＋",{"$f":"①漢字入力!H6","v":"少"}]
[null,"女",0.84928268530227924,2,"女","市",3,"止","少",null,null,null,{"$f":"①漢字入力!E7","v":"女"},"＋",{"$f":"①漢字入力!H7","v":"市"}]
[null,"七",0.47624043439381947,4,"七","刀",4,"七","刀",null,null,null,{"$f":"①漢字入力!E8","v":"七"},"＋",{"$f":"①漢字入力!H8","v":"刀"}]
[null,"ネ",0.9944691186927056,1,"ネ","土",5,"タ","タ",null,null,null,{"$f":"①漢字入力!E9","v":"ネ"},"＋",{"$f":"①漢字入力!H9","v":"土"}]
[null,"イ",0.24811723462675184,6,"イ","本",6,"イ","本",null,null,null,{"$f":"①漢字入力!E10","v":"イ"},"＋",{"$f":"①漢字入力!H10","v":"本"}]
[null,"タ",0.31206751330605398,5,"タ","タ",null,null,null,null,null,null,{"$f":"①漢字入力!E11","v":"タ"},"＋",{"$f":"①漢字入力!H11","v":"タ"}]
[null,{"$f":"O2","v":"少"},null,{"$f":"D2","v":3}]
[null,"市",null,2]
[null,"刀",null,4]
[null,"土",null,1]
[null,"本",null,6]
[null,"タ",null,5]

{"sheet":"②漢字データ","index":6,"n_rows":1030,"n_cols":36,"rows_kept":1030,"cut":false,"hidden":false,"merged":[]}
["通し番号","整理番号","漢字","読み","音訓","問題","送り仮名",null,null,null,null,null,null,{"$f":"①漢字入力!Q2","v":2.0459999999999998}]
[{"$f":"B2*1000","v":1000.9999999999999},1.0009999999999999,"木",1,null,null,null,null,null,null,null,null,null,null,null,{"$f":"IF(B2>N$1,0,D2)","v":1},{"$f":"IF(P2=2,B2,0)","v":0}]
[1002,1.002,"大",1,null,null,null,null,null,null,null,null,null,null,null,1,0,null,null,2045.9999999999998,2.0459999999999998,"歩",2,null,"止","+","少",null,null,null,"＝","歩",null,null,2,2.0459999999999998]
[1002.9999999999999,1.0029999999999999,"小",1,null,null,null,null,null,null,null,null,null,null,null,1,0,null,null,2040,2.04,"姉",2,null,"女","+","市",null,null,null,"＝","姉",null,null,2,2.04]
[1004,1.004,"一",1,null,null,null,null,null,null,null,null,null,null,null,1,0,null,null,2037,2.0369999999999999,"切",2,null,"七","+","刀",null,null,null,"＝","切",null,null,2,2.0369999999999999]
[1004.9999999999999,1.0049999999999999,"二",1,null,null,null,null,null,null,null,null,null,null,null,1,0,null,null,2035.0000000000002,2.0350000000000001,"社",2,null,"ネ","+","土",null,null,null,"＝","社",null,null,2,2.0350000000000001]
[1006,1.006,"三",1,null,null,null,null,null,null,null,null,null,null,null,1,0,null,null,2029.9999999999998,2.0299999999999998,"体",2,null,"イ","+","本",null,null,null,"＝","体",null,null,2,2.0299999999999998]
[1006.9999999999999,1.0069999999999999,"四",1,null,null,null,null,null,null,null,null,null,null,null,1,0,null,null,2025.9999999999998,2.0259999999999998,"多",2,null,"タ","+","タ",null,null,null,"＝","多",null,null,2,2.0259999999999998]
[1008,1.008,"五",1,null,null,null,null,null,null,null,null,null,null,null,1,0,null,null,2025,2.0249999999999999,"晴",2,null,"日","+","青",null,null,null,"＝","晴",null,null,2,2.0249999999999999]
[1008.9999999999999,1.0089999999999999,"六",1,null,null,null,null,null,null,null,null,null,null,null,1,0,null,null,2012,2.012,"思",2,null,"田","+","心",null,null,null,"＝","思",null,null,2,2.012]
[1010,1.01,"七",1,null,null,null,null,null,null,null,null,null,null,null,1,0,null,null,2009,2.0089999999999999,"分",2,null,"八","+","刀",null,null,null,"＝","分",null,null,2,2.0089999999999999]
[1010.9999999999999,1.0109999999999999,"八",1,null,null,null,null,null,null,null,null,null,null,null,1,0,null,null,2007.0000000000002,2.0070000000000001,"絵",2,null,"糸","+","会",null,null,null,"＝","絵",null,null,2,2.0070000000000001]
[1012,1.012,"九",1,null,null,null,null,null,null,null,null,null,null,null,1,0,null,null,2001,2.0009999999999999,"読",2,null,"言","+","売",null,null,null,"＝","読",null,null,2,2.0009999999999999]
[1012.9999999999999,1.0129999999999999,"十",1,null,null,null,null,null,null,null,null,null,null,null,1,0,null,null,1075,1.075,"林",2,null,"木","+","木",null,null,null,"＝","林",null,null,2,1.075]
[1014,1.014,"子",1,null,null,null,null,null,null,null,null,null,null,null,1,0,null,null,1074,1.0740000000000001,"貝",2,null,"目","+","八",null,null,null,"＝","貝",null,null,2,1.0740000000000001]
[1014.9999999999999,1.0149999999999999,"空",1,null,null,null,null,null,null,null,null,null,null,null,1,0,null,null,1073,1.073,"早",2,null,"日","+","十",null,null,null,"＝","早",null,null,2,1.073]
[1016,1.016,"男",2,null,"田","+","力",null,null,null,"＝",{"$f":"C17","v":"男"},null,null,2,1.016,null,null,1062,1.0620000000000001,"音",2,null,"立","+","日",null,null,null,"＝","音",null,null,2,1.0620000000000001]
[1016.9999999999999,1.0169999999999999,"女",1,null,null,null,null,null,null,null,null,null,null,null,1,0,null,null,1053,1.0529999999999999,"休",2,null,"イ","+","木",null,null,null,"＝","休",null,null,2,1.0529999999999999]
[1018,1.018,"手",1,null,null,null,null,null,null,null,null,null,null,null,1,0,null,null,1050,1.05,"百",2,null,"一","+","白",null,null,null,"＝","百",null,null,2,1.05]
[1018.9999999999999,1.0189999999999999,"天",2,null,"一","+","大",null,null,null,"＝",{"$f":"C20","v":"天"},null,null,2,1.0189999999999999,null,null,1048,1.048,"名",2,null,"夕","+","口",null,null,null,"＝","名",null,null,2,1.048]
[1020,1.02,"青",1,null,null,null,null,null,null,null,null,null,null,null,1,0,null,null,1043,1.0429999999999999,"森",2,null,"木","+","林",null,null,null,"＝","森",null,null,2,1.0429999999999999]
[1020.9999999999999,1.0209999999999999,"見",1,null,null,null,null,null,null,null,null,null,null,null,1,0,null,null,1042,1.042,"本",2,null,"木","+","一",null,null,null,"＝","本",null,null,2,1.042]
[1022,1.022,"学",1,null,null,null,null,null,null,null,null,null,null,null,1,0,null,null,1018.9999999999999,1.0189999999999999,"天",2,null,"一","+","大",null,null,null,"＝","天",null,null,2,1.0189999999999999]
[1022.9999999999999,1.0229999999999999,"校",1,null,null,null,null,null,null,null,null,null,null,null,1,0,null,null,1016,1.016,"男",2,null,"田","+","力",null,null,null,"＝","男",null,null,2,1.016]
[1024,1.024,"虫",1,null,null,null,null,null,null,null,null,null,null,null,1,0,null,null,1000.9999999999999,1.0009999999999999,"木",1,null,null,null,null,null,null,null,null,null,null,null,1,0]
[1025,1.0249999999999999,"文",1,null,null,null,null,null,null,null,null,null,null,null,1,0,null,null,1002,1.002,"大",1,null,null,null,null,null,null,null,null,null,null,null,1,0]
[1026,1.026,"正",1,null,null,null,null,null,null,null,null,null,null,null,1,0,null,null,1002.9999999999999,1.0029999999999999,"小",1,null,null,null,null,null,null,null,null,null,null,null,1,0]
[1027,1.0269999999999999,"字",1,null,null,null,null,null,null,null,null,null,null,null,1,0,null,null,1004,1.004,"一",1,null,null,null,null,null,null,null,null,null,null,null,1,0]
[1028,1.028,"山",1,null,null,null,null,null,null,null,null,null,null,null,1,0,null,null,1004.9999999999999,1.0049999999999999,"二",1,null,null,null,null,null,null,null,null,null,null,null,1,0]
[1029,1.0289999999999999,"水",1,null,null,null,null,null,null,null,null,null,null,null,1,0,null,null,1006,1.006,"三",1,null,null,null,null,null,null,null,null,null,null,null,1,0]
{"$rows_left_out":1001}
{"sheet":"Sheet1","index":7,"n_rows":0,"n_cols":0,"rows_kept":0,"cut":false,"hidden":false,"merged":[]}

{"sheet":"データ","index":8,"n_rows":114,"n_cols":14,"rows_kept":114,"cut":false,"hidden":false,"merged":[]}
[null,"木","目","相",{"$f":"INDEX($B$1:$B37,RANK(INDEX($H$1:$H$37,ROW(I1)),$H$1:$H$37))","v":"立"},{"$f":"INDEX($C$1:$C$37,RANK(INDEX($H$1:$H$37,ROW(C1)),$H$1:$H$37))","v":"市"},{"$f":"INDEX($D$1:$D$37,RANK(INDEX($H$1:$H$37,ROW(D1)),$H$1:$H$37))","v":"意"},{"$f":"RAND()/100","v":8.3111772843556878E-3}]
[null,"日","宿","暗",{"$f":"INDEX($B$1:$B38,RANK(INDEX($H$1:$H$37,ROW(I2)),$H$1:$H$37))","v":"音"},"十","章",4.8263997314403964E-3]
[null,"立","市","意",{"$f":"INDEX($B$1:$B39,RANK(INDEX($H$1:$H$37,ROW(I3)),$H$1:$H$37))","v":"糸"},"東","練",3.2453535404428869E-3]
[null,"木","反","板",{"$f":"INDEX($B$1:$B40,RANK(INDEX($H$1:$H$37,ROW(I4)),$H$1:$H$37))","v":"竹"},"寺","等",1.3580111796917026E-3]
[null,"糸","少","終",{"$f":"INDEX($B$1:$B41,RANK(INDEX($H$1:$H$37,ROW(I5)),$H$1:$H$37))","v":"木"},"反","板",7.790760684668897E-3]
[null,"言","女","詩",{"$f":"INDEX($B$1:$B42,RANK(INDEX($H$1:$H$37,ROW(I6)),$H$1:$H$37))","v":"木"},"司","横",7.6232120429391311E-4]
[null,"日","者","暑",{"$f":"INDEX($B$1:$B43,RANK(INDEX($H$1:$H$37,ROW(I7)),$H$1:$H$37))","v":"日"},"宿","暗",9.0307151160368172E-3]
[null,"音","十","章",{"$f":"INDEX($B$1:$B44,RANK(INDEX($H$1:$H$37,ROW(I8)),$H$1:$H$37))","v":"木"},"目","相",9.1249271789540422E-3]
[null,"木","直","植",{"$f":"INDEX($B$1:$B45,RANK(INDEX($H$1:$H$37,ROW(I9)),$H$1:$H$37))","v":"火"},"田","畑",1.9917408183724337E-3]
[null,"相","心","想",{"$f":"INDEX($B$1:$B46,RANK(INDEX($H$1:$H$37,ROW(I10)),$H$1:$H$37))","v":"自"},"心","息",3.7883598906083516E-3]
[null,"自","心","息",{"$f":"INDEX($B$1:$B47,RANK(INDEX($H$1:$H$37,ROW(I11)),$H$1:$H$37))","v":"門"},"口","問",1.1807226292866813E-3]
[null,"羽","心","習",{"$f":"INDEX($B$1:$B48,RANK(INDEX($H$1:$H$37,ROW(I12)),$H$1:$H$37))","v":"木"},"直","植",4.4575897018962881E-3]
[null,"糸","東","練",{"$f":"INDEX($B$1:$B49,RANK(INDEX($H$1:$H$37,ROW(I13)),$H$1:$H$37))","v":"立"},"里","童",6.2122832453251559E-4]
[null,"竹","相","箱",{"$f":"INDEX($B$1:$B50,RANK(INDEX($H$1:$H$37,ROW(I14)),$H$1:$H$37))","v":"相"},"心","想",4.2510483808136075E-3]
[null,"火","田","畑",{"$f":"INDEX($B$1:$B51,RANK(INDEX($H$1:$H$37,ROW(I15)),$H$1:$H$37))","v":"糸"},"少","終",6.9799018012080584E-3]
[null,"竹","寺","等",{"$f":"INDEX($B$1:$B52,RANK(INDEX($H$1:$H$37,ROW(I16)),$H$1:$H$37))","v":"日"},"者","暑",5.2398623768173261E-3]
[null,"門","口","問",{"$f":"INDEX($B$1:$B53,RANK(INDEX($H$1:$H$37,ROW(I17)),$H$1:$H$37))","v":"竹"},"相","箱",1.9983748170329862E-3]
[null,"木","司","横",{"$f":"INDEX($B$1:$B54,RANK(INDEX($H$1:$H$37,ROW(I18)),$H$1:$H$37))","v":"言"},"女","詩",5.6318498068568187E-3]
[null,"立","里","童",{"$f":"INDEX($B$1:$B55,RANK(INDEX($H$1:$H$37,ROW(I19)),$H$1:$H$37))","v":"羽"},"心","習",3.466489163239256E-3]
[]
[null,{"$f":"C21*1000","v":6000},6,"警",null,null,"敬","+","言",null,null,null,"＝",{"$f":"D21","v":"警"}]
[null,6000,6,"系　",null,null,"ノ","+","糸",null,null,null,"＝","系　"]
[null,6001,6.0010000000000003,"視",null,null,"　ネ","+","見",null,null,null,"＝","視"]
[null,6003,6.0030000000000001,"砂",null,null,"石","+","少",null,null,null,"＝","砂"]
[null,6010,6.01,"異",null,null,"田","+","共",null,null,null,"＝","異"]
[null,6013,6.0129999999999999,"背",null,null,"北","+","月",null,null,null,"＝","背"]
[null,6014,6.0140000000000002,"舌",null,null,"ノ","+","古",null,null,null,"＝","舌"]
[null,6019,6.0190000000000001,"訪",null,null,"言","+","方",null,null,null,"＝","訪"]
[null,6027,6.0270000000000001,"恩",null,null,"因","+","心",null,null,null,"＝","恩"]
[null,6031,6.0309999999999997,"臓",null,null,"月","+","蔵",null,null,null,"＝","臓"]
{"$rows_left_out":84}